Getting started with workbench and receiving error of no sources when compile locally

make[2]: Circular c:/Users/jonkl/OneDrive/Desktop/Particle <- c:/Users/jonkl/OneDrive/Desktop/Particle dependency dropped.
make[2]: Circular c:/Users/jonkl/OneDrive/Desktop/Particle <- c:/Users/jonkl/OneDrive/Desktop/Particle dependency dropped.
build.mk:67: *** “No sources found in c:/Users/jonkl/OneDrive/Desktop/Particle Projects/test-1/”. Stop.
make[2]: *** […/…/…/build/recurse.mk:12: user] Error 2
make[1]: *** [makefile:86: /cygdrive/c/Users/jonkl/.particle/toolchains/deviceOS/1.5.2/modules/electron/user-part/makefile] Error 2
make: *** [C:\Users\jonkl.particle\toolchains\buildscripts\1.9.2\Makefile:60: compile-all] Error 2
The terminal process terminated with exit code: 2