Particle Workbench Error Code "2"

Hi! Whenever I try to flash anything or compile anything, this comes up:

../../../build/module.mk:236: warning: overriding recipe for target 'c:/Users/gamma/Downloads/Particle'
../../../build/module.mk:229: warning: ignoring old recipe for target 'c:/Users/gamma/Downloads/Particle'
../../../build/module.mk:236: warning: overriding recipe for target '/cygdrive/c/Users/gamma/.particle/toolchains/deviceOS/1.5.2/main/Project/thing/target/1.5.2/photon//Particle'
../../../build/module.mk:229: warning: ignoring old recipe for target '/cygdrive/c/Users/gamma/.particle/toolchains/deviceOS/1.5.2/main/Project/thing/target/1.5.2/photon//Particle'
../../../build/module.mk:245: warning: overriding recipe for target 'c:/Users/gamma/Downloads/Particle'
../../../build/module.mk:236: warning: ignoring old recipe for target 'c:/Users/gamma/Downloads/Particle'
../../../build/module.mk:245: warning: overriding recipe for target '/cygdrive/c/Users/gamma/.particle/toolchains/deviceOS/1.5.2/main/Project/thing/target/1.5.2/photon//Particle'
../../../build/module.mk:236: warning: ignoring old recipe for target '/cygdrive/c/Users/gamma/.particle/toolchains/deviceOS/1.5.2/main/Project/thing/target/1.5.2/photon//Particle'
../../../build/module.mk:269: warning: overriding recipe for target 'c:/Users/gamma/Downloads/Particle'
../../../build/module.mk:245: warning: ignoring old recipe for target 'c:/Users/gamma/Downloads/Particle'
../../../build/module.mk:268: *** mixed implicit and normal rules: deprecated syntax
../../../build/module.mk:274: warning: overriding recipe for target 'c:/Users/gamma/Downloads/Particle'
../../../build/module.mk:269: warning: ignoring old recipe for target 'c:/Users/gamma/Downloads/Particle'
../../../build/module.mk:273: *** mixed implicit and normal rules: deprecated syntax
../../../build/module.mk:274: warning: overriding recipe for target '/cygdrive/c/Users/gamma/.particle/toolchains/deviceOS/1.5.2/main/Project/thing/target/1.5.2/photon//obj/%.o'
../../../build/module.mk:269: warning: ignoring old recipe for target '/cygdrive/c/Users/gamma/.particle/toolchains/deviceOS/1.5.2/main/Project/thing/target/1.5.2/photon//obj/%.o'
../../../build/module.mk:290: warning: overriding recipe for target 'c:/Users/gamma/Downloads/Particle'
../../../build/module.mk:274: warning: ignoring old recipe for target 'c:/Users/gamma/Downloads/Particle'
../../../build/module.mk:289: *** mixed implicit and normal rules: deprecated syntax
../../../build/module.mk:290: warning: overriding recipe for target '/cygdrive/c/Users/gamma/.particle/toolchains/deviceOS/1.5.2/main/Project/thing/target/1.5.2/photon//obj/%.o'
../../../build/module.mk:274: warning: ignoring old recipe for target '/cygdrive/c/Users/gamma/.particle/toolchains/deviceOS/1.5.2/main/Project/thing/target/1.5.2/photon//obj/%.o'
make[2]: Circular c:/Users/gamma/Downloads/Particle <- c:/Users/gamma/Downloads/Particle dependency dropped.
make[2]: Circular c:/Users/gamma/Downloads/Particle <- c:/Users/gamma/Downloads/Particle dependency dropped.
make[2]: Circular c:/Users/gamma/Downloads/Particle <- c:/Users/gamma/Downloads/Particle dependency dropped.
make[2]: Circular c:/Users/gamma/Downloads/Particle <- c:/Users/gamma/Downloads/Particle dependency dropped.
make[2]: Circular c:/Users/gamma/Downloads/Particle <- c:/Users/gamma/Downloads/Particle dependency dropped.
make[2]: Circular c:/Users/gamma/Downloads/Particle <- c:/Users/gamma/Downloads/Particle dependency dropped.
make[2]: Circular c:/Users/gamma/Downloads/Particle <- c:/Users/gamma/Downloads/Particle dependency dropped.
make[2]: Circular c:/Users/gamma/Downloads/Particle <- c:/Users/gamma/Downloads/Particle dependency dropped.
make[2]: Circular c:/Users/gamma/Downloads/Particle <- c:/Users/gamma/Downloads/Particle dependency dropped.
make[2]: Circular c:/Users/gamma/Downloads/Particle <- c:/Users/gamma/Downloads/Particle dependency dropped.
make[2]: Circular c:/Users/gamma/Downloads/Particle <- c:/Users/gamma/Downloads/Particle dependency dropped.
make[2]: Circular c:/Users/gamma/Downloads/Particle <- c:/Users/gamma/Downloads/Particle dependency dropped.
build.mk:67: *** "No sources found in c:/Users/gamma/Downloads/Particle Project/thing/".  Stop.
make[2]: *** [../../../build/recurse.mk:12: user] Error 2
make[1]: *** [../build/recurse.mk:12: modules/photon/user-part] Error 2
make: *** [C:\Users\gamma\.particle\toolchains\buildscripts\1.9.2\Makefile:72: flash-user] Error 2
The terminal process "C:\Users\gamma\.particle\toolchains\buildtools\1.1.1\bin\bash.exe '-c', 'make -f 'C:\Users\gamma\.particle\toolchains\buildscripts\1.9.2\Makefile' flash-user -s'" terminated with exit code: 2.

I have tried Particle: Reset Environment and Particle: Reset Local Compiler Toolchain and neither of these worked; Help!

You should not have blanks (or other special characters) in your build path.
All these warnings inform you about a path c:/Users/gamma/Downloads/Particle which is obviously broken at the blank of c:/Users/gamma/Downloads/Particle Project/

Try removing the blank in Particle Project.

3 Likes